Cordova errore quando cerco di emulare o creare la app

simgia

Nuovo Utente
26 Set 2017
17
0
1
48
Ciao a tutti, sono nuovo in questo forum ed è un piacere conoscere un forum del genere.

Sa alcuni giorni ricevo questo errore quando tutto funzionava bene prima.
Ho già fatto ricerche sul web e qualsiasi soluzione che ho trovato non ha funzionato

Codice:
Starting a Gradle Daemon, 1 incompatible and 1 stopped Daemons could not be reused, use --status for details
Warning: Mapping new ns http://schemas.android.com/repository/android/common/02 to old ns http://schemas.android.com/repository/android/common/01
Warning: Mapping new ns http://schemas.android.com/repository/android/generic/02 to old ns http://schemas.android.com/repository/android/generic/01
Warning: Mapping new ns http://schemas.android.com/sdk/android/repo/addon2/02 to old ns http://schemas.android.com/sdk/android/repo/addon2/01
Warning: Mapping new ns http://schemas.android.com/sdk/android/repo/addon2/03 to old ns http://schemas.android.com/sdk/android/repo/addon2/01
Warning: Mapping new ns http://schemas.android.com/sdk/android/repo/repository2/02 to old ns http://schemas.android.com/sdk/android/repo/repository2/01
Warning: Mapping new ns http://schemas.android.com/sdk/android/repo/repository2/03 to old ns http://schemas.android.com/sdk/android/repo/repository2/01
Warning: Mapping new ns http://schemas.android.com/sdk/android/repo/sys-img2/03 to old ns http://schemas.android.com/sdk/android/repo/sys-img2/01
Warning: Mapping new ns http://schemas.android.com/sdk/android/repo/sys-img2/02 to old ns http://schemas.android.com/sdk/android/repo/sys-img2/01
> Task :app:mergeDebugResources FAILED

FAILURE: Build failed with an exception.                                                                                             

* What went wrong:
Execution failed for task ':app:mergeDebugResources'.
> A failure occurred while executing com.android.build.gradle.internal.res.ResourceCompilerRunnable
   > Resource compilation failed. Check logs for details.

* Try:
Run with --stacktrace option to get the stack trace. Run with --info or --debug option to get more log output. Run with --scan to get full insights.

* Get more help at https://help.gradle.org

Deprecated Gradle features were used in this build, making it incompatible with Gradle 8.0.

You can use '--warning-mode all' to show the individual deprecation warnings and determine if they come from your own scripts or plugins.

See https://docs.gradle.org/7.1.1/userguide/command_line_interface.html#sec:command_line_warnings

BUILD FAILED in 26s
27 actionable tasks: 1 executed, 26 up-to-date
Command failed with exit code 1: C:\Users\comun\Desktop\Project APP\radio_matese_app\platforms\android\gradlew cdvBuildDebug -b C:\Users\comun\Desktop\Project APP\radio_matese_app\platforms\android\build.gradle

Spero che qualcuno mi aiuti a risolvere questa situazione perché sto impazzendo sono giorni che ci sto dietro e non me ne esco, ho disinstallato Android Studio e reinstallato, ho disinstallato cordova ed reinstalla ma nulla.
 
Discussioni simili
Autore Titolo Forum Risposte Data
simgia Cordova A failure occurred while executing com.android.build.gradle.internal.res.ResourceComp ilerRunnable Sviluppo app per Android 1
C Apache Cordova problema con php Programmazione 1
A cordova-plugin-background-mode Sviluppo app per Android 0
radioButton App ios con vs e apache cordova Sviluppo app per iOS 1
M Apache Cordova problema aggiungere platform android Sviluppo app per Android 1
P Errore nell'indirizzo degli elementi HTML e CSS 2
Jensen Errore di sintassi con DELETE PHP 3
H Errore su array associativo PHP 1
FDF182 ERRORE 1292 PHP 4
P errore 404 con javascript Javascript 2
felino Windows 7: errore 80072EFE su Windows Update Windows e Software 1
A errore http://datatables.net/tn/7 PHP 4
M Errore visualizzazione meta tag title e description SEO e Posizionamento 1
A Errore durante il salvataggio Photoshop 0
M Errore configurazione motion detection nvr Hikvision DS-7616 IP Cam e Videosorveglianza 0
voldemort [c] Errore di segmentazione (core dump creato) C/C++ 1
T SSD - errore sistema Hardware 2
R Navigare sito con cURL, mi restituisce errore PHP 0
L File CSV con app inventor da errore Sviluppo app per Android 2
A Errore visualizzazione selezione testo Photoshop 0
I Postman 400 Errore di richiesta non valida Programmazione 0
S Errore PHP - Notice: Undefined index ... PHP 14
U Campo vuoto data errore Fatal error: PHP 2
R Errore UPDATE tabella mysql PHP 1
R W10 Segnalazione di errore su terminale USB Windows e Software 0
G non riesco a capire quale sia l'errore [SQL] MySQL 2
I Errore 80040220 nella newsletter con paginazione Classic ASP 0
E Errore di lettura php in html PHP 8
A php metodo post jquery non da mai errore jQuery 4
W Errore di run-time di Microsoft VBScript error '800a0035' Impossibile trovare il file Classic ASP 0
B Errore unexpected '$variabile' (T_VARIABLE) in your code on line PHP 2
M errore dopo passaggio Php 7.2 PHP 6
S -> Errore PHP 8
S Errore "ftp_put(): Can't open that file: Permission denied" PHP 1
P Errore telecamere hdcvi dahua IP Cam e Videosorveglianza 16
L form multipla php sql,errore in inserimento MySQL 0
M Errore JavaScript per php [objeto HTMLParagraphElement] PHP 0
F [PHP]Errore registrazione PHP 8
MarcoGrazia [PHP] Download di file con errore all'interno. PHP 1
V [ORACLE] Errore ora-06512 at sys.utl_file Oracle 0
A [WordPress] Errore Plugin WordPress 0
P [WordPress] Messaggio di errore in file style.css WordPress 0
G [Javascript] Errore inserimento dati Backend Node.js e workbench Javascript 1
M [PHP] WS-Security errore PHP 0
E Errore configurazione 18 Dahua Dome POE IP Cam e Videosorveglianza 6
M [PHP] Errore di percorso, file not found PHP 3
MrSab [MySQL] Foreign key errore MySQL 5
D Acer errore 0701: USB Over Current... Hardware 0
gandalf1959 Errore di connessione a DB MySql PHP 5
ANDREA20 errore php PHP 1

Discussioni simili